{"text_format":"1","workbook":"xlsx","n_sheets":4,"sheets":["Opskrifter","Vare","Retter","Indkøb"],"not_rendered":{"charts":0,"images":2,"macros":1,"external_links":0,"defined_names":2,"comments":0,"pivot_tables":0},"unopened":[],"bounds":{"document_bytes":16777216,"sheet_cells":100000,"rows_first":2000,"rows_last":500,"rows_between":2000,"halvings":0,"cell_chars":16384,"cell_head_chars":4096},"cells_cut":0,"cells_raw":0,"read":"whole","date_system":"1900"}

{"sheet":"Opskrifter","index":0,"n_rows":28,"n_cols":3,"rows_kept":28,"cut":false,"hidden":false,"merged":[]}
[]
["Menu","½ kylling "]
[]
["Ingridienser","Indkøb","Enhed"]
[]
["Agurkesalat",1,{"$f":"IFERROR(VLOOKUP(A6,Vare!$A$2:$I$840,4,FALSE),\"\")","v":"DS"}]
["Kylling Griller 1300 g",1,{"$f":"IFERROR(VLOOKUP(A7,Vare!$A$2:$I$840,4,FALSE),\"\")","v":"STK"}]
["Remoulade",1,{"$f":"IFERROR(VLOOKUP(A8,Vare!$A$2:$I$840,4,FALSE),\"\")","v":"FL"}]
[null,null,{"$f":"IFERROR(VLOOKUP(A9,Vare!$A$2:$I$840,4,FALSE),\"\")","v":""}]
[null,null,{"$f":"IFERROR(VLOOKUP(A10,Vare!$A$2:$I$840,4,FALSE),\"\")","v":""}]
[null,null,{"$f":"IFERROR(VLOOKUP(A11,Vare!$A$2:$I$840,4,FALSE),\"\")","v":""}]
[null,null,{"$f":"IFERROR(VLOOKUP(A12,Vare!$A$2:$I$840,4,FALSE),\"\")","v":""}]
[null,null,{"$f":"IFERROR(VLOOKUP(A13,Vare!$A$2:$I$840,4,FALSE),\"\")","v":""}]
[null,null,{"$f":"IFERROR(VLOOKUP(A14,Vare!$A$2:$I$840,4,FALSE),\"\")","v":""}]
[null,null,{"$f":"IFERROR(VLOOKUP(A15,Vare!$A$2:$I$840,4,FALSE),\"\")","v":""}]
[null,null,{"$f":"IFERROR(VLOOKUP(A16,Vare!$A$2:$I$840,4,FALSE),\"\")","v":""}]
[null,null,{"$f":"IFERROR(VLOOKUP(A17,Vare!$A$2:$I$840,4,FALSE),\"\")","v":""}]
[null,null,{"$f":"IFERROR(VLOOKUP(A18,Vare!$A$2:$I$840,4,FALSE),\"\")","v":""}]
[null,null,{"$f":"IFERROR(VLOOKUP(A19,Vare!$A$2:$I$840,4,FALSE),\"\")","v":""}]
[null,null,{"$f":"IFERROR(VLOOKUP(A20,Vare!$A$2:$I$840,4,FALSE),\"\")","v":""}]
[null,null,{"$f":"IFERROR(VLOOKUP(A21,Vare!$A$2:$I$840,4,FALSE),\"\")","v":""}]
[null,null,{"$f":"IFERROR(VLOOKUP(A22,Vare!$A$2:$I$840,4,FALSE),\"\")","v":""}]
[null,null,{"$f":"IFERROR(VLOOKUP(A23,Vare!$A$2:$I$840,4,FALSE),\"\")","v":""}]
[null,null,{"$f":"IFERROR(VLOOKUP(A24,Vare!$A$2:$I$840,4,FALSE),\"\")","v":""}]
[null,null,{"$f":"IFERROR(VLOOKUP(A25,Vare!$A$2:$I$840,4,FALSE),\"\")","v":""}]
[null,null,{"$f":"IFERROR(VLOOKUP(A26,Vare!$A$2:$I$840,4,FALSE),\"\")","v":""}]
[null,null,{"$f":"IFERROR(VLOOKUP(A27,Vare!$A$2:$I$840,4,FALSE),\"\")","v":""}]
[null,null,{"$f":"IFERROR(VLOOKUP(A28,Vare!$A$2:$I$840,4,FALSE),\"\")","v":""}]

{"sheet":"Vare","index":1,"n_rows":835,"n_cols":227,"rows_kept":835,"cut":false,"hidden":false,"merged":[]}
["Beskrivelse","Mærke","Faktureret antal","Basisenhed","Købt","Salgsbeløb (faktisk)","Stk. pris","I alt","Gruppe","½ kylling ","Apple pie ","Aspargessuppe","Avocado m. rejer ","Bagt laks ","Barbecue kylling ","Biksemad","Boller i karry","Brownie m. is ","Bruchetta","Brunsviger ","Brændende kærlighed","Buffalo chicken","Burger","Butter chicken","Butterdej m. skinke og broccoli ","Butterdejspakker","Byg selv burger","Byg selv sandwich","Bøf bernaise","Bøf m. rødvinssauce","Bøf stroganoff","Camembert frites ","Carbonara","Cheesecake","Chili con carne","Chokolade fondant ","Chokoladekage","Chokolademousse","Citronfromage ","Citrontærte","Club sandwich","Coq au vin","Creme brulee","Cremet pasta m. laks","Culottesteg ","Cæsarsalat m. kylling","Dannebrogsgryde","Dansk bøf","Drømmekage","Dunse sandwich","Engelsk bøf","Fish 'n' chips","Fisk","Fiskefilet m. remo","Fiskefrikadeller","Fiskesalat","Flæskesteg","Flæskestegssandwich","Forloren hare","Forårsruller","Fransk løgsuppe","Frikadeller","Frikadeller m. hvidkål","Frikadeller m. kartofler","Frugtsalat m. råcreme","Frugtsuppe","Frugttærte ","Fyldt kylling ","Fyldte peberfrugter","Gammeldaws oksesteg","Gammeldaws æblekage","Gazpacho","Glaseret skinke","Gratineret hvidløgsrejer","Gratineret torsk","Gravad laks","Grillspyd","Græske kødboller","Gullash m. mos","Hakkebøf m. bløde løg","Hamburgerryg ","Hamburgerryg m. grønt","Hellefisk ","Helstegt kylling ","Helstegt rødspætte","Herregårdsbøf ","Herregårdsskinke ","Hindbærmousse","Hot wings","Hotdogs","Hønsesuppe","Indbagt laks","Is","Is m. vafler og guf","Islagkage ","Jordbær m. fløde","Jordskokkesuppe","Kalkunbryst","Kalv stegt som vildt","Kalve culotte","Kalvekoteletter ","Kalvemørbrad","Kalvesteak m. pommes","Kammusling ","Karbonader","Karry würst","Karrysuppe","Kartoffelporresuppe ","Kebabmix","Kokkens sorte gryde","Koldskål","Kong Frederiks livret ","Koteletter i fad ","Krebinetter","Kylling","Kylling i karry","Kylling m. fries","Kylling m. kartofsalat","Kylling m. pommes","Kylling thai karry ","Kylling/spinat lasagne","Kyllinge-frikassé","Kyllingeoverlår m. pasta","Kyllingesandwich","Kylling-spinat lasagne","Kød/melbolle suppe","Lagkage","Laks m. hollandaise","Laks m. stuvet spinat","Laksefillet","Lakseroulade ","Laksetatar ","Lammekølle ","Lasagne","Limetærte","Mac 'n' cheese","Marineret mørbrad","Mazarin","Medister","Mexi pandekager","Mexiburger","Mexicansk","Millionbøf","Moules frites","Mørbrad m. bacon","Mørbradgryde  ","Nachos","Nakkefilet","Nøddebund m. hindbærmousse","Oksefilet","Oksefilet","Ovnbagt laks","Pandekager m. is","Paneret stegt flæsk","Panna cotta","Paprikagryde","Pariserbøf","Pasta","Pasta bolognese","Pasta m. kødboller","Pasta m. pesto/kylling","Pastaret","Peberbøf","Peberhakkebøf","Pirogger ","Pita","Pizza","Porchetta","Pulled pork burger","Purésuppe ","Pølsehorn","Pølsemix","Rabarbergrød ","Rabarbersuppe m. is ","Rabarbertrifli ","Rejecocktail","Rejespyd","Ribbenstegsburger","Ris taffel","Risengrød","Rispapirsruller","Ristet brød m. svampe","Rodfrugtssuppe","Rødgrød","Rødtunge","Saltimbocca","Skaldyrsrisotto","Skinkeschnitzler ","Skipperlabscovs","Smuldrepai","Spareribs","Steaks","Stegt flæsk","Stegt tun","Stegte rejer i hvidløg","Stjerneskud","Suppe","Svamperisotto ","Svensk pølseret","Svin a la creme","Svinekoteletter ","Svinemørbrad","Svøbt asparges","Tacoskaller","Tarteletter","Tatar","T-bone steak","Thaisuppe m. kylling","Tikka masala ","Tiramisu","Toast","Tomatsuppe","Torsk","Torsk m. gratin","Tortelinni ","Tunmousse m. salat","Tunsalat","Tærte","Vafler a la Kuffen","Valnøddebrownie ","Vaniljeis m. bær","Vildt gryde m. kartofmos","Wienerschnitzel","Wok","Æggekage m. bacon","Ærtesuppe","Ørred"]
["5-Kornsblanding","HAVNEMØL",2,"SÆK",null,334,{"$f":"F2/C2","v":167},{"$f":"E2*G2","v":0},"Mel"]
["A38 Ymer 3,5%","ARLA A38",117,"STK",null,1497.6,12.799999999999999,{"$f":"E3*G3","v":0},"Mælk & Smør"]
["Agurk m/Film DK","GRØNT",76.5,"KS",null,1593.81,20.834117647058822,0,"Frisk Frugt og Grønt",null,null,null,null,null,null,null,null,null,null,null,null,null,2]
["Agurk u/film","GRØNT",77.55,"KG",null,1452.19,18.725854287556416,0,"Frisk Frugt og Grønt"]
["Agurkesalat","SAMSØ",8,"DS",null,306.64,38.33,0,"Survarer m.v.",1]
["Akaciehonning Squeeze","JAKOBSEN",56,"FL",null,1414,25.25,0,"Kolonial"]
["All Bran Regular","KELLOGGS",32,"PK",null,954.28,29.821249999999999,0,"Kolonial"]
["Ananas stor","GRØNT",25.72,"KG",null,278,10.808709175738725,0,"Frisk Frugt og Grønt"]
["Andebryst Berberi 300-400 g","DK TRAD",34.127000000000002,"KG",null,2935.26,86.009904181439921,0,"Ænder & Kalkuner"]
["Andefedt","ROUGIE",3,"DS",null,146.46,48.82,0,"Kødkonserves m.m."]
["Andelår Berberi 300-400 g","DK TRAD",10,"KG",null,448.4,44.839999999999996,0,"Ænder & Kalkuner"]
["Andelår Confit","LABEYRIE",20,"DS",null,2452.6,122.63,0,"Kødkonserves m.m."]
["Andepaté m/Madagascarpeber FR","DELITAST",2,"STK",null,183.85,91.924999999999997,0,"Pålæg"]
["Ansjosfilet i Olie","PONTE S",6,"GL",null,207.42,34.57,0,"Fiskekonserves"]
["Appelsiner Stor","GRØNT",45,"KG",null,558.75,12.416666666666666,0,"Frisk Frugt og Grønt"]
["Appelsinjuice 1 ltr","RYNKEBY",364,"STK",null,5132.72,14.100879120879121,0,"Saft Juice & Læskedrik"]
["Appelsinmarmelade Portion","RYNKEBY",2,"KRT",null,178.2,89.1,0,"Marmelade Syltetøj & Grød"]
["Artiskokhjerte Grillet Kvart","PONTE S",1,"GL",null,56.18,56.18,0,"Grøntkonserves"]
["Asier Strimler","SAMSØ",4,"DS",null,240.08,60.02,0,"Survarer m.v."]
["Asparges Grønne","GRØNT",17,"KG",null,1263.3,74.311764705882354,0,"Frisk Frugt og Grønt"]
["Aspargessnitte m/Hoved Fin","LIBITOP",3,"DS",null,159.38999999999999,53.129999999999995,0,"Grøntkonserves"]
["Aspic Pålægssky Mørk 30 ltr","KNORR",1,"DS",null,314.47000000000003,314.47000000000003,0,"Tørsupper, Tørsauce m.v."]
["Aubergine","GRØNT",5,"KG",null,90,18,0,"Frisk Frugt og Grønt"]
["Avocado ReadyToEat","GRØNT",28,"KG",null,1592.56,56.877142857142857,0,"Frisk Frugt og Grønt"]
["Bacon Gourmet Tørsaltet/Peber","SUBLIM",22.16,"KG",null,1515.96,68.409747292418771,0,"Svinekødsprodukter"]
["Bacon Koge","CATER F",21.94,"KG",null,1341.85,61.159981768459424,0,"Svinekødsprodukter"]
["Bacon Røget Skiver Køl","TULIP",3,"PK",null,214.92,71.64,0,"Svinekødsprodukter"]
["Bacon Skiver","QUALITY",148,"PK",null,6606.72,44.64,0,"Svinekødsprodukter"]
["Bacon Stege Tørsaltet Hel","CATER F",10.41,"KG",null,820.83,78.850144092219026,0,"Svinekødsprodukter"]
["Bagekartofler","GRØNT",270,"KG",null,1801.15,6.6709259259259266,0,"Frisk Frugt og Grønt"]
["Bagepulver Almindelig","TØRSLEFF",1,"BT",null,52.08,52.08,0,"Bageartikler"]
["Baguette Parisienne Stenovnsb","KOHBERG",1,"KRT",null,155.21,155.21,0,"Brød Bake Off"]
["Bambusskud Strimler","ASIANWOK",2,"DS",null,48.16,24.08,0,"Grøntkonserves"]
["Bananer","GRØNT",136.80000000000001,"KG",null,1890.6,13.82017543859649,0,"Frisk Frugt og Grønt"]
["Basilikum i Bundt","GRØNT",0.5,"KG",null,142.5,285,0,"Frisk Frugt og Grønt"]
["Basilikum i Stor Potte","LEGRO",0.16,"KG",null,39.299999999999997,245.62499999999997,0,"Frisk Frugt og Grønt"]
["Basilikum Løst pakket i Bakke","LEGRO",1.1000000000000001,"KG",null,417.56,379.59999999999997,0,"Frisk Frugt og Grønt"]
["Bearnaiseessens","BEAUVAIS",2,"FL",null,90.66,45.33,0,"Kolonial"]
["Benfri Sild","TENAX",3,"BT",null,266.27999999999997,88.759999999999991,0,"Fiskekonserves"]
["Bierwurst","CATERKØD",3.62,"KG",null,171.55,47.389502762430944,0,"Pålæg"]
["Birkes Blå","SUN ISLA",13,"PS",null,261.39999999999998,20.107692307692307,0,"Kolonial"]
["Birkes Hvid","SUN ISLA",13,"PS",null,326.75,25.134615384615383,0,"Kolonial"]
["BlackTiger Rå Pillet 16/20","NORDIC S",10,"PS",null,1275,127.5,0,"Fisk"]
["Blandet Saft A 1+4 10 ltr","RYNKEBY",22,"DK",null,4531.78,205.98999999999998,0,"Saft Juice & Læskedrik"]
["Blegselleri DK","GRØNT",1.998,"KG",null,29.97,15,0,"Frisk Frugt og Grønt"]
["Blokspegepølse m/Peber","CATERKØD",5.3,"KG",null,445.3,84.018867924528308,0,"Pålæg"]
["Blomkål DK","GRØNT",34,"KG",null,522.54,15.368823529411763,0,"Frisk Frugt og Grønt"]
["Blommer","GRØNT",50,"KG",null,1378.35,27.566999999999997,0,"Frisk Frugt og Grønt"]
["Blåbær","FRIGODAN",4,"PS",null,183.6,45.9,0,"Frugt Dybfrost"]
["Blåbær bk","GRØNT",3.5,"KG",null,485.84,138.81142857142856,0,"Frisk Frugt og Grønt"]
["Blåmusling Hel Kogt 50/80","PLANETS",2,"PS",null,61.8,30.9,0,"Fisk"]
["Blåmusling i Net 1000g","CAT FISK",25.3,"KG",null,516.28,20.406324110671935,0,"Fisk, fersk"]
["Bolchebeder","GRØNT",5,"KG",null,83.55,16.71,0,"Frisk Frugt og Grønt"]
["Bordsalt Fint m/Jod","JOZO",30,"PK",null,148.5,4.95,0,"Krydderier"]
["Bresaola Black Angus","DELITAST",3.339,"KG",null,697.85,{"$f":"F56/C56","v":208.99970050913447},0,"Pålæg"]
["Brie President 60%","PRESIDEN",6.282,"KG",null,419.01,66.700095510983758,{"$f":"E57*G57","v":0},"Ost"]
["Broccoli DK","GRØNT",53.6,"KG",null,1476.84,27.552985074626864,0,"Frisk Frugt og Grønt"]
["Brombær bk","GRØNT",4.875,"KG",null,763.66,156.64820512820512,0,"Frisk Frugt og Grønt"]
["Brombærpuré","BOIRON",4,"PK",null,440.68,110.17,0,"Puré"]
["Brun Farin","DANSUKKE",48,"PK",null,399.84,8.33,0,"Melis & øvrige sukkerprodukter"]
["Brunchpølse 20 g","KOKKENS",4.3760000000000003,"KG",null,292.83999999999997,66.919561243144415,0,"Svinekødsprodukter"]
["Brystflæsk u/Ben Top Køl","AB SLAGT",30.46,"KG",null,1393.55,45.750164149704531,0,"Svinekød"]
["Brøndkarse i Potte","GRØNT",0.4,"KG",null,93.04,232.6,0,"Frisk Frugt og Grønt"]
["Buko Alpeost 17%","BUKO",20,"STK",null,345.6,17.28,0,"Ost"]
["Buko Champignonost Port 18%","BUKO",4,"KRT",null,366.04,91.51,0,"Ost"]
["Buko Fløde/Smelteost Ass 20 g","BUKO",1,"KRT",null,90.92,90.92,0,"Ost"]
["Buko Flødeost Pikant 20 g","BUKO",9,"KRT",null,818.28,90.92,0,"Ost"]
["Buko Flødeost Pikant 23%","BUKO",10,"STK",null,131.6,13.16,0,"Ost"]
["Buko Rejeost Portion 18%","BUKO",9,"KRT",null,823.59,91.51,0,"Ost"]
["Buko Skinkeost Port 18%","BUKO",7,"KRT",null,640.57000000000005,91.51,0,"Ost"]
["Bulgur Fin","UNIFOOD",4,"PS",null,50.52,12.63,0,"Kolonial"]
["Bulgur Grov","DURU",1,"PS",null,38.200000000000003,38.200000000000003,0,"Kolonial"]
["Burgerbolle Buffalo","SCHULSTA",2,"KRT",null,410,205,0,"Brød Fast Food",null,null,null,null,null,null,null,null,null,null,null,null,null,55]
["Buræg Str M Plast DK","DANÆG",19,"BK",null,617.5,32.5,0,"Æg & Ægprodukter"]
["Butterdejsplade 46x56 cm","HUMLUM",2,"KRT",null,476.78,238.39,0,"Brød Bake Off"]
["Bødker Bacon Røget","BØDKER",27.04,"KG",null,1429.25,52.856878698224854,0,"Svinekødsprodukter"]
["Bødker Hamburgerryg u/Ben","BØDKER",34.06,"KG",null,1582.78,46.470346447445678,0,"Svinekødsprodukter"]
["Bøfpeber Grøn","SUNBEST",1,"DS",null,14.17,14.17,0,"Grøntkonserves"]
["Bønner Bobby","GRØNT",6,"KG",null,393.08,65.513333333333335,0,"Frisk Frugt og Grønt"]
["Bønner friske nippet","GRØNT",2,"KG",null,198,99,0,"Frisk Frugt og Grønt"]
["Camembert Paneret Forbagt","CHEF S",2,"KRT",null,350,175,0,"Forårsruller m.v."]
["Capers Nonpareilles","PARADISO",1,"GL",null,177.71,177.71,0,"Survarer m.v."]
["Capersbær m/Stilk","SUNBEST",2,"GL",null,94.94,47.47,0,"Survarer m.v."]
["Cashewnøddekerner W320","ABL FOOD",2,"PS",null,286.14,143.07,0,"Nødder & Mandler"]
["Caterblommer Neutral Køl","GALLINA",16,"DK",null,2806.12,175.38249999999999,0,"Æg & Ægprodukter"]
["Caterhvider Køl","GALLINA",7,"DK",null,559.58000000000004,79.940000000000012,0,"Æg & Ægprodukter"]
["CdO Chokoladeis","CARTE D",2,"SP",null,426.96,213.48,0,"Iscreme"]
["CdO Jordbæris","CARTE D",2,"SP",null,396.96,198.48,0,"Iscreme"]
["CdO Vaniljeis","CARTE D",2,"SP",null,396.96,198.48,0,"Iscreme"]
["Cervelatpølse","TULIP",2,"STK",null,132.47999999999999,66.239999999999995,0,"Pålæg"]
["Champignon Hel Grillet i Olie","FELDTHUS",6,"BT",null,543.78,90.63,0,"Grøntkonserves"]
["Champignon i Bakke","GRØNT",2,"KG",null,84,42,0,"Frisk Frugt og Grønt"]
["Champignon Rodskåret","GRØNT",37.5,"KG",null,860.8,22.954666666666665,0,"Frisk Frugt og Grønt"]
["Cheddar Revet Rød","FALENGR",18,"PS",null,839.64,46.646666666666668,0,"Ost"]
["ChickenWings Buffalo ExtraHot","SALOMON",24,"PS",null,3364.08,140.16999999999999,0,"Kyllinger & Høns"]
["Chili Carolina Reaper","GRØNT",0.3,"KG",null,221.2,737.33333333333337,0,"Frisk Frugt og Grønt"]
["Chili Grøn","GRØNT",0.45,"KG",null,22.95,51,0,"Frisk Frugt og Grønt"]
["Chili Habanero","GRØNT",1.05,"KG",null,160.65,153,0,"Frisk Frugt og Grønt"]
["Chili Mix","GRØNT",7.0000000000000007E-2,"KG",null,15.77,225.28571428571425,0,"Frisk Frugt og Grønt"]
["Chili Rød","GRØNT",0.15,"KG",null,9.9499999999999993,66.333333333333329,0,"Frisk Frugt og Grønt"]
["Chilisauce Squeeze","LINGHAM",36,"FL",null,924.84,25.69,0,"Saucer Soya m.v."]
["Chilisauce Sriracha Hot","LINGHAM",9,"FL",null,390.96,43.44,0,"Saucer Soya m.v."]
["Chipotle Chili Paste","SANTA M",1,"DS",null,68.05,68.05,0,"Krydderier"]
["Chokodråbe Mørk Bagestabil L","CALLEBAU",2,"PS",null,485.36,242.68,0,"Chokolade & Marcipan"]
["Chokoladedrik Fantasy Blue UTZ","DOUWE E",20,"PS",null,971.8,48.589999999999996,0,"Kaffe, The & Chokoladedrik"]
["Chorizo Extra Vela","DELITAST",10.89,"KG",null,710.46,65.239669421487605,0,"Pålæg"]
["Chorizo Iberisk","DELITAST",1.08,"KG",null,100.12,92.703703703703695,0,"Pålæg"]
["Chorizo San Polo 80 mm","DELIKA",1.865,"KG",null,114.81,61.560321715817693,0,"Pålæg"]
["Cider Val de Rance Brut 4% Øko","VAL DE R",12,"FL",null,558,46.5,0,"Øl og Sodavand"]
["Citron","GRØNT",99,"KG",null,2275.44,22.984242424242424,0,"Frisk Frugt og Grønt"]
["Citrongræs ps","GRØNT",0.1,"KG",null,29.26,292.60000000000002,0,"Frisk Frugt og Grønt"]
["Citronsaft","REALEMON",1,"FL",null,22.99,22.99,0,"Kolonial"]
["Citronsaft","VERIBEST",5,"FL",null,92.3,18.46,0,"Kolonial"]
["Citronsaft","SVANSØ",2,"FL",null,35.96,17.98,0,"Saft Juice & Læskedrik"]
["Citronverbena i Bakke","LEGRO",0.03,"KG",null,24,800,0,"Frisk Frugt og Grønt"]
["Comté Le Montagnard AOP","ARNAUD",2.09,"KG",null,283.11,135.45933014354068,0,"Ost"]
["Cornflakes","KELLOGGS",28,"PK",null,813.68,{"$f":"F118/C118","v":29.06},0,"Kolonial"]
["CousCous Grov","UNIFOOD",2,"PS",null,81.86,40.93,{"$f":"E119*G119","v":0},"Kolonial"]
["CremeFraiche Arla Pro 18%","ARLA PRO",2,"SP",null,217.84,108.92,0,"Mælk & Smør"]
{"$rows_left_out":716}
{"sheet":"Retter","index":2,"n_rows":219,"n_cols":3,"rows_kept":219,"cut":false,"hidden":false,"merged":[]}
["Menu","Kolonne",{"$f":"VLOOKUP(Opskrifter!B2,Retter!A:B,2,FALSE)","v":10}]
["½ kylling ",10]
["Apple pie ",11]
["Aspargessuppe",12]
["Avocado m. rejer ",13]
["Bagt laks ",14]
["Barbecue kylling ",15]
["Biksemad",16]
["Boller i karry",17]
["Brownie m. is ",18]
["Bruchetta",19]
["Brunsviger ",20]
["Brændende kærlighed",21]
["Buffalo chicken",22]
["Burger",23]
["Butter chicken",24]
["Butterdej m. skinke og broccoli ",25]
["Butterdejspakker",26]
["Byg selv burger",27]
["Byg selv sandwich",28]
["Bøf bernaise",29]
["Bøf m. rødvinssauce",30]
["Bøf stroganoff",31]
["Camembert frites ",32]
["Carbonara",33]
["Cheesecake",34]
["Chili con carne",35]
["Chokolade fondant ",36]
["Chokoladekage",37]
["Chokolademousse",38]
["Citronfromage ",39]
["Citrontærte",40]
["Club sandwich",41]
["Coq au vin",42]
["Creme brulee",43]
["Cremet pasta m. laks",44]
["Culottesteg ",45]
["Cæsarsalat m. kylling",46]
["Dannebrogsgryde",47]
["Dansk bøf",48]
["Drømmekage",49]
["Dunse sandwich",50]
["Engelsk bøf",51]
["Fish 'n' chips",52]
["Fisk",53]
["Fiskefilet m. remo",54]
["Fiskefrikadeller",55]
["Fiskesalat",56]
["Flæskesteg",57]
["Flæskestegssandwich",58]
["Forloren hare",59]
["Forårsruller",60]
["Fransk løgsuppe",61]
["Frikadeller",62]
["Frikadeller m. hvidkål",63]
["Frikadeller m. kartofler",64]
["Frugtsalat m. råcreme",65]
["Frugtsuppe",66]
["Frugttærte ",67]
["Fyldt kylling ",68]
["Fyldte peberfrugter",69]
["Gammeldaws oksesteg",70]
["Gammeldaws æblekage",71]
["Gazpacho",72]
["Glaseret skinke",73]
["Gratineret hvidløgsrejer",74]
["Gratineret torsk",75]
["Gravad laks",76]
["Grillspyd",77]
["Græske kødboller",78]
["Gullash m. mos",79]
["Hakkebøf m. bløde løg",80]
["Hamburgerryg ",81]
["Hamburgerryg m. grønt",82]
["Hellefisk ",83]
["Helstegt kylling ",84]
["Helstegt rødspætte",85]
["Herregårdsbøf ",86]
["Herregårdsskinke ",87]
["Hindbærmousse",88]
["Hot wings",89]
["Hotdogs",90]
["Hønsesuppe",91]
["Indbagt laks",92]
["Is",93]
["Is m. vafler og guf",94]
["Islagkage ",95]
["Jordbær m. fløde",96]
["Jordskokkesuppe",97]
["Kalkunbryst",98]
["Kalv stegt som vildt",99]
["Kalve culotte",100]
["Kalvekoteletter ",101]
["Kalvemørbrad",102]
["Kalvesteak m. pommes",103]
["Kammusling ",104]
["Karbonader",105]
["Karry würst",106]
["Karrysuppe",107]
["Kartoffelporresuppe ",108]
["Kebabmix",109]
["Kokkens sorte gryde",110]
["Koldskål",111]
["Kong Frederiks livret ",112]
["Koteletter i fad ",113]
["Krebinetter",114]
["Kylling",115]
["Kylling i karry",116]
["Kylling m. fries",117]
["Kylling m. kartofsalat",118]
["Kylling m. pommes",119]
["Kylling thai karry ",120]
["Kylling/spinat lasagne",121]
["Kyllinge-frikassé",122]
["Kyllingeoverlår m. pasta",123]
["Kyllingesandwich",124]
["Kylling-spinat lasagne",125]
["Kød/melbolle suppe",126]
["Lagkage",127]
["Laks m. hollandaise",128]
{"$rows_left_out":100}
{"sheet":"Indkøb","index":3,"n_rows":23,"n_cols":3,"rows_kept":23,"cut":false,"hidden":false,"merged":[]}
["Ingridienser","Indkøb","Enhed"]
[{"$f":"IFERROR(INDEX(Opskrifter!$A$6:$A$43,SMALL(IF(Opskrifter!$B$6:$B$43<>0,ROW(Opskrifter!$A$6:$A$43)-CELL(\"row\",Opskrifter!$A$6:$A$43)+1),ROWS($1:1))),\"\")","v":"Agurkesalat"},{"$f":"IFERROR(VLOOKUP(A2,Opskrifter!$A$6:$C$35,2,FALSE),\"\")","v":1},{"$f":"IFERROR(VLOOKUP(A2,Opskrifter!$A$6:$C$35,3,FALSE),\"\")","v":"DS"}]
[{"$f":"IFERROR(INDEX(Opskrifter!$A$6:$A$43,SMALL(IF(Opskrifter!$B$6:$B$43<>0,ROW(Opskrifter!$A$6:$A$43)-CELL(\"row\",Opskrifter!$A$6:$A$43)+1),ROWS($1:2))),\"\")","v":"Kylling Griller 1300 g"},{"$f":"IFERROR(VLOOKUP(A3,Opskrifter!$A$6:$C$35,2,FALSE),\"\")","v":1},{"$f":"IFERROR(VLOOKUP(A3,Opskrifter!$A$6:$C$35,3,FALSE),\"\")","v":"STK"}]
[{"$f":"IFERROR(INDEX(Opskrifter!$A$6:$A$43,SMALL(IF(Opskrifter!$B$6:$B$43<>0,ROW(Opskrifter!$A$6:$A$43)-CELL(\"row\",Opskrifter!$A$6:$A$43)+1),ROWS($1:3))),\"\")","v":"Remoulade"},{"$f":"IFERROR(VLOOKUP(A4,Opskrifter!$A$6:$C$35,2,FALSE),\"\")","v":1},{"$f":"IFERROR(VLOOKUP(A4,Opskrifter!$A$6:$C$35,3,FALSE),\"\")","v":"FL"}]
[{"$f":"IFERROR(INDEX(Opskrifter!$A$6:$A$43,SMALL(IF(Opskrifter!$B$6:$B$43<>0,ROW(Opskrifter!$A$6:$A$43)-CELL(\"row\",Opskrifter!$A$6:$A$43)+1),ROWS($1:4))),\"\")","v":""},{"$f":"IFERROR(VLOOKUP(A5,Opskrifter!$A$6:$C$35,2,FALSE),\"\")","v":""},{"$f":"IFERROR(VLOOKUP(A5,Opskrifter!$A$6:$C$35,3,FALSE),\"\")","v":""}]
[{"$f":"IFERROR(INDEX(Opskrifter!$A$6:$A$43,SMALL(IF(Opskrifter!$B$6:$B$43<>0,ROW(Opskrifter!$A$6:$A$43)-CELL(\"row\",Opskrifter!$A$6:$A$43)+1),ROWS($1:5))),\"\")","v":""},{"$f":"IFERROR(VLOOKUP(A6,Opskrifter!$A$6:$C$35,2,FALSE),\"\")","v":""},{"$f":"IFERROR(VLOOKUP(A6,Opskrifter!$A$6:$C$35,3,FALSE),\"\")","v":""}]
[{"$f":"IFERROR(INDEX(Opskrifter!$A$6:$A$43,SMALL(IF(Opskrifter!$B$6:$B$43<>0,ROW(Opskrifter!$A$6:$A$43)-CELL(\"row\",Opskrifter!$A$6:$A$43)+1),ROWS($1:6))),\"\")","v":""},{"$f":"IFERROR(VLOOKUP(A7,Opskrifter!$A$6:$C$35,2,FALSE),\"\")","v":""},{"$f":"IFERROR(VLOOKUP(A7,Opskrifter!$A$6:$C$35,3,FALSE),\"\")","v":""}]
[{"$f":"IFERROR(INDEX(Opskrifter!$A$6:$A$43,SMALL(IF(Opskrifter!$B$6:$B$43<>0,ROW(Opskrifter!$A$6:$A$43)-CELL(\"row\",Opskrifter!$A$6:$A$43)+1),ROWS($1:7))),\"\")","v":""},{"$f":"IFERROR(VLOOKUP(A8,Opskrifter!$A$6:$C$35,2,FALSE),\"\")","v":""},{"$f":"IFERROR(VLOOKUP(A8,Opskrifter!$A$6:$C$35,3,FALSE),\"\")","v":""}]
[{"$f":"IFERROR(INDEX(Opskrifter!$A$6:$A$43,SMALL(IF(Opskrifter!$B$6:$B$43<>0,ROW(Opskrifter!$A$6:$A$43)-CELL(\"row\",Opskrifter!$A$6:$A$43)+1),ROWS($1:8))),\"\")","v":""},{"$f":"IFERROR(VLOOKUP(A9,Opskrifter!$A$6:$C$35,2,FALSE),\"\")","v":""},{"$f":"IFERROR(VLOOKUP(A9,Opskrifter!$A$6:$C$35,3,FALSE),\"\")","v":""}]
[{"$f":"IFERROR(INDEX(Opskrifter!$A$6:$A$43,SMALL(IF(Opskrifter!$B$6:$B$43<>0,ROW(Opskrifter!$A$6:$A$43)-CELL(\"row\",Opskrifter!$A$6:$A$43)+1),ROWS($1:9))),\"\")","v":""},{"$f":"IFERROR(VLOOKUP(A10,Opskrifter!$A$6:$C$35,2,FALSE),\"\")","v":""},{"$f":"IFERROR(VLOOKUP(A10,Opskrifter!$A$6:$C$35,3,FALSE),\"\")","v":""}]
[{"$f":"IFERROR(INDEX(Opskrifter!$A$6:$A$43,SMALL(IF(Opskrifter!$B$6:$B$43<>0,ROW(Opskrifter!$A$6:$A$43)-CELL(\"row\",Opskrifter!$A$6:$A$43)+1),ROWS($1:10))),\"\")","v":""},{"$f":"IFERROR(VLOOKUP(A11,Opskrifter!$A$6:$C$35,2,FALSE),\"\")","v":""},{"$f":"IFERROR(VLOOKUP(A11,Opskrifter!$A$6:$C$35,3,FALSE),\"\")","v":""}]
[{"$f":"IFERROR(INDEX(Opskrifter!$A$6:$A$43,SMALL(IF(Opskrifter!$B$6:$B$43<>0,ROW(Opskrifter!$A$6:$A$43)-CELL(\"row\",Opskrifter!$A$6:$A$43)+1),ROWS($1:11))),\"\")","v":""},{"$f":"IFERROR(VLOOKUP(A12,Opskrifter!$A$6:$C$35,2,FALSE),\"\")","v":""},{"$f":"IFERROR(VLOOKUP(A12,Opskrifter!$A$6:$C$35,3,FALSE),\"\")","v":""}]
[{"$f":"IFERROR(INDEX(Opskrifter!$A$6:$A$43,SMALL(IF(Opskrifter!$B$6:$B$43<>0,ROW(Opskrifter!$A$6:$A$43)-CELL(\"row\",Opskrifter!$A$6:$A$43)+1),ROWS($1:12))),\"\")","v":""},{"$f":"IFERROR(VLOOKUP(A13,Opskrifter!$A$6:$C$35,2,FALSE),\"\")","v":""},{"$f":"IFERROR(VLOOKUP(A13,Opskrifter!$A$6:$C$35,3,FALSE),\"\")","v":""}]
[{"$f":"IFERROR(INDEX(Opskrifter!$A$6:$A$43,SMALL(IF(Opskrifter!$B$6:$B$43<>0,ROW(Opskrifter!$A$6:$A$43)-CELL(\"row\",Opskrifter!$A$6:$A$43)+1),ROWS($1:13))),\"\")","v":""},{"$f":"IFERROR(VLOOKUP(A14,Opskrifter!$A$6:$C$35,2,FALSE),\"\")","v":""},{"$f":"IFERROR(VLOOKUP(A14,Opskrifter!$A$6:$C$35,3,FALSE),\"\")","v":""}]
[null,{"$f":"IFERROR(VLOOKUP(A15,Opskrifter!$A$6:$C$35,2,FALSE),\"\")","v":""},{"$f":"IFERROR(VLOOKUP(A15,Opskrifter!$A$6:$C$35,3,FALSE),\"\")","v":""}]
[null,{"$f":"IFERROR(VLOOKUP(A16,Opskrifter!$A$6:$C$35,2,FALSE),\"\")","v":""},{"$f":"IFERROR(VLOOKUP(A16,Opskrifter!$A$6:$C$35,3,FALSE),\"\")","v":""}]
[null,{"$f":"IFERROR(VLOOKUP(A17,Opskrifter!$A$6:$C$35,2,FALSE),\"\")","v":""},{"$f":"IFERROR(VLOOKUP(A17,Opskrifter!$A$6:$C$35,3,FALSE),\"\")","v":""}]
[null,{"$f":"IFERROR(VLOOKUP(A18,Opskrifter!$A$6:$C$35,2,FALSE),\"\")","v":""},{"$f":"IFERROR(VLOOKUP(A18,Opskrifter!$A$6:$C$35,3,FALSE),\"\")","v":""}]
[null,{"$f":"IFERROR(VLOOKUP(A19,Opskrifter!$A$6:$C$35,2,FALSE),\"\")","v":""},{"$f":"IFERROR(VLOOKUP(A19,Opskrifter!$A$6:$C$35,3,FALSE),\"\")","v":""}]
[null,{"$f":"IFERROR(VLOOKUP(A20,Opskrifter!$A$6:$C$35,2,FALSE),\"\")","v":""},{"$f":"IFERROR(VLOOKUP(A20,Opskrifter!$A$6:$C$35,3,FALSE),\"\")","v":""}]
[null,{"$f":"IFERROR(VLOOKUP(A21,Opskrifter!$A$6:$C$35,2,FALSE),\"\")","v":""}]
[null,{"$f":"IFERROR(VLOOKUP(A22,Opskrifter!$A$6:$C$35,2,FALSE),\"\")","v":""}]
[null,{"$f":"IFERROR(VLOOKUP(A23,Opskrifter!$A$6:$C$35,2,FALSE),\"\")","v":""}]