{"text_format":"1","workbook":"xlsx","n_sheets":3,"sheets":["Årlig timeseddel","T","SetUp"],"not_rendered":{"charts":0,"images":0,"macros":1,"external_links":0,"defined_names":2,"comments":0,"pivot_tables":0},"unopened":[],"bounds":{"document_bytes":16777216,"sheet_cells":100000,"rows_first":2000,"rows_last":500,"rows_between":2000,"halvings":0,"cell_chars":16384,"cell_head_chars":4096},"cells_cut":0,"cells_raw":0,"read":"whole","date_system":"1900"}

{"sheet":"Årlig timeseddel","index":0,"n_rows":156,"n_cols":16,"rows_kept":156,"cut":false,"hidden":false,"merged":[[9,1,9,15],[46,1,46,15],[83,1,83,15],[120,1,120,15],[43,6,43,7],[10,11,10,12],[43,11,43,12],[44,6,44,8],[47,6,47,7],[121,1,121,2],[121,6,121,7],[47,11,47,12],[80,1,80,2],[0,1,1,20],[80,11,80,12],[81,1,81,3],[81,6,81,8],[81,11,81,13],[43,1,43,2],[44,1,44,3],[10,1,10,2],[10,6,10,7],[47,1,47,2],[44,11,44,13],[80,6,80,7],[155,1,155,3],[155,6,155,8],[155,11,155,13],[84,1,84,2],[84,6,84,7],[84,11,84,12],[117,1,117,2],[117,6,117,7],[117,11,117,12],[118,1,118,3],[118,6,118,8],[118,11,118,13],[121,11,121,12],[154,1,154,2],[154,6,154,7],[154,11,154,12],[2,8,2,11],[3,8,3,11],[2,1,2,2],[3,1,3,2],[7,1,7,2],[2,3,2,6]]}
[null,"Timeseddel for medarbejder"]
[]
[null,"Medarbejdernavn:",null,{"$f":"SetUp!C3","v":"-"},null,null,null,"E-mail:",{"$f":"SetUp!C7","v":"-"}]
[null,"Overordnet:",null,{"$f":"SetUp!C5","v":"-"},null,null,null,"Tlf.nr.:",{"$f":"SetUp!C9","v":"-"}]
[]
[]
[null,"År til dato i alt:"]
[null,"Timer i alt:",null,{"$f":"D44+I44+N44+D81+I81+N81+D118+I118+N118+D155+I155+N155","v":0},null,null,null,"Overtid, timer:",{"$f":"E45+J45+O45+E82+J82+O82+E119+J119+O119+E156+J156+O156","v":0},null,null,null,"Normal timer:",{"$f":"D8-I8","v":0}]
[]
[null,"Januar, februar, marts Timeseddel for medarbejder: daglig, ugentlig, månedlig, årlig"]
[null,{"$f":"CHOOSE(D11,\"Januar\",\"Februar\",\"Marts\",\"April\",\"Maj\",\"Juni\",\"Juli\",\"August\",\"September\",\"Oktober\",\"November\",\"December\")","v":"Januar"},null,1,null,null,{"$f":"CHOOSE(I11,\"Januar\",\"Februar\",\"Marts\",\"April\",\"Maj\",\"Juni\",\"Juli\",\"August\",\"September\",\"Oktober\",\"November\",\"December\")","v":"Februar"},null,2,null,null,{"$f":"CHOOSE(N11,\"Januar\",\"Februar\",\"Marts\",\"April\",\"Maj\",\"Juni\",\"Juli\",\"August\",\"September\",\"Oktober\",\"November\",\"December\")","v":"Marts"},null,3]
[null,"Dag","Dato","Timer","Overtid","Bemærk.","Dag","Dato","Timer","Overtid","Bemærk.","Dag","Dato","Timer","Overtid","Bemærk."]
[null,{"$f":"TEXT(C13,\"dddd\")","v":"tirsdag"},{"$f":"DATE(T!$B$2,D11,1)","v":"2019-01-01"},null,null,null,{"$f":"TEXT(H13,\"dddd\")","v":"fredag"},{"$f":"DATE(T!$B$2,I11,1)","v":"2019-02-01"},null,null,null,{"$f":"TEXT(M13,\"dddd\")","v":"fredag"},{"$f":"DATE(T!$B$2,N11,1)","v":"2019-03-01"}]
[null,{"$f":"TEXT(C14,\"dddd\")","v":"onsdag"},{"$f":"C13+1","v":"2019-01-02"},null,null,null,{"$f":"TEXT(H14,\"dddd\")","v":"lørdag"},{"$f":"H13+1","v":"2019-02-02"},null,null,null,{"$f":"TEXT(M14,\"dddd\")","v":"lørdag"},{"$f":"M13+1","v":"2019-03-02"}]
[null,"torsdag",{"$f":"C14+1","v":"2019-01-03"},null,null,null,"søndag",{"$f":"H14+1","v":"2019-02-03"},null,null,null,"søndag",{"$f":"M14+1","v":"2019-03-03"}]
[null,"fredag","2019-01-04",null,null,null,"mandag","2019-02-04",null,null,null,"mandag","2019-03-04"]
[null,"lørdag","2019-01-05",null,null,null,"tirsdag","2019-02-05",null,null,null,"tirsdag","2019-03-05"]
[null,"søndag","2019-01-06",null,null,null,"onsdag","2019-02-06",null,null,null,"onsdag","2019-03-06"]
[null,"mandag","2019-01-07",null,null,null,"torsdag","2019-02-07",null,null,null,"torsdag","2019-03-07"]
[null,"tirsdag","2019-01-08",null,null,null,"fredag","2019-02-08",null,null,null,"fredag","2019-03-08"]
[null,"onsdag","2019-01-09",null,null,null,"lørdag","2019-02-09",null,null,null,"lørdag","2019-03-09"]
[null,"torsdag","2019-01-10",null,null,null,"søndag","2019-02-10",null,null,null,"søndag","2019-03-10"]
[null,"fredag","2019-01-11",null,null,null,"mandag","2019-02-11",null,null,null,"mandag","2019-03-11"]
[null,"lørdag","2019-01-12",null,null,null,"tirsdag","2019-02-12",null,null,null,"tirsdag","2019-03-12"]
[null,"søndag","2019-01-13",null,null,null,"onsdag","2019-02-13",null,null,null,"onsdag","2019-03-13"]
[null,"mandag","2019-01-14",null,null,null,"torsdag","2019-02-14",null,null,null,"torsdag","2019-03-14"]
[null,"tirsdag","2019-01-15",null,null,null,"fredag","2019-02-15",null,null,null,"fredag","2019-03-15"]
[null,"onsdag","2019-01-16",null,null,null,"lørdag","2019-02-16",null,null,null,"lørdag","2019-03-16"]
[null,"torsdag","2019-01-17",null,null,null,"søndag","2019-02-17",null,null,null,"søndag","2019-03-17"]
[null,"fredag","2019-01-18",null,null,null,"mandag","2019-02-18",null,null,null,"mandag","2019-03-18"]
[null,"lørdag","2019-01-19",null,null,null,"tirsdag","2019-02-19",null,null,null,"tirsdag","2019-03-19"]
[null,"søndag","2019-01-20",null,null,null,"onsdag","2019-02-20",null,null,null,"onsdag","2019-03-20"]
[null,"mandag","2019-01-21",null,null,null,"torsdag","2019-02-21",null,null,null,"torsdag","2019-03-21"]
[null,"tirsdag","2019-01-22",null,null,null,"fredag","2019-02-22",null,null,null,"fredag","2019-03-22"]
[null,"onsdag","2019-01-23",null,null,null,"lørdag","2019-02-23",null,null,null,"lørdag","2019-03-23"]
[null,"torsdag","2019-01-24",null,null,null,"søndag","2019-02-24",null,null,null,"søndag","2019-03-24"]
[null,"fredag","2019-01-25",null,null,null,"mandag","2019-02-25",null,null,null,"mandag","2019-03-25"]
[null,"lørdag","2019-01-26",null,null,null,"tirsdag","2019-02-26",null,null,null,"tirsdag","2019-03-26"]
[null,"søndag","2019-01-27",null,null,null,"onsdag","2019-02-27",null,null,null,"onsdag","2019-03-27"]
[null,"mandag","2019-01-28",null,null,null,"torsdag","2019-02-28",null,null,null,"torsdag","2019-03-28"]
[null,"tirsdag",{"$f":"IF(MONTH(C40+1)>MONTH(C40),\"\",C40+1)","v":"2019-01-29"},null,null,null,"",{"$f":"IF(MONTH(H40+1)>MONTH(H40),\"\",H40+1)","v":""},null,null,null,"fredag",{"$f":"IF(MONTH(M40+1)>MONTH(M40),\"\",M40+1)","v":"2019-03-29"}]
[null,"onsdag",{"$f":"IFERROR(IF(MONTH(C41+1)>MONTH(C41),\"\",C41+1),\"\")","v":"2019-01-30"},null,null,null,"",{"$f":"IFERROR(IF(MONTH(H41+1)>MONTH(H41),\"\",H41+1),\"\")","v":""},null,null,null,"lørdag",{"$f":"IFERROR(IF(MONTH(M41+1)>MONTH(M41),\"\",M41+1),\"\")","v":"2019-03-30"}]
[null,"torsdag",{"$f":"IFERROR(IF(MONTH(C42+1)>MONTH(C42),\"\",C42+1),\"\")","v":"2019-01-31"},null,null,null,"",{"$f":"IFERROR(IF(MONTH(H42+1)>MONTH(H42),\"\",H42+1),\"\")","v":""},null,null,null,"søndag",{"$f":"IFERROR(IF(MONTH(M42+1)>MONTH(M42),\"\",M42+1),\"\")","v":"2019-03-31"}]
[null,"Jan. i alt: normale timer",null,{"$f":"SUM(D13:D43)","v":0},null,null,"Jan. i alt: normale timer",null,{"$f":"SUM(I13:I43)","v":0},null,null,"Jan. i alt: normale timer",null,{"$f":"SUM(N13:N43)","v":0}]
[null,"Jan. i alt: overtid",null,null,{"$f":"SUM(E13:E43)","v":0},null,"Jan. i alt: overtid",null,null,{"$f":"SUM(J13:J43)","v":0},null,"Jan. i alt: overtid",null,null,{"$f":"SUM(O13:O43)","v":0}]
[]
[null,"April, maj, juni Timeseddel for medarbejder: daglig, ugentlig, månedlig, årlig"]
[null,{"$f":"CHOOSE(D48,\"Januar\",\"Februar\",\"Marts\",\"April\",\"Maj\",\"Juni\",\"Juli\",\"August\",\"September\",\"Oktober\",\"November\",\"December\")","v":"April"},null,4,null,null,{"$f":"CHOOSE(I48,\"Januar\",\"Februar\",\"Marts\",\"April\",\"Maj\",\"Juni\",\"Juli\",\"August\",\"September\",\"Oktober\",\"November\",\"December\")","v":"Maj"},null,5,null,null,{"$f":"CHOOSE(N48,\"Januar\",\"Februar\",\"Marts\",\"April\",\"Maj\",\"Juni\",\"Juli\",\"August\",\"September\",\"Oktober\",\"November\",\"December\")","v":"Juni"},null,6]
[null,"Dag","Dato","Timer","Overtid","Bemærk.","Dag","Dato","Timer","Overtid","Bemærk.","Dag","Dato","Timer","Overtid","Bemærk."]
[null,{"$f":"TEXT(C50,\"dddd\")","v":"mandag"},{"$f":"DATE(T!$B$2,D48,1)","v":"2019-04-01"},null,null,null,{"$f":"TEXT(H50,\"dddd\")","v":"onsdag"},{"$f":"DATE(T!$B$2,I48,1)","v":"2019-05-01"},null,null,null,{"$f":"TEXT(M50,\"dddd\")","v":"lørdag"},{"$f":"DATE(T!$B$2,N48,1)","v":"2019-06-01"}]
[null,{"$f":"TEXT(C51,\"dddd\")","v":"tirsdag"},{"$f":"C50+1","v":"2019-04-02"},null,null,null,{"$f":"TEXT(H51,\"dddd\")","v":"torsdag"},{"$f":"H50+1","v":"2019-05-02"},null,null,null,{"$f":"TEXT(M51,\"dddd\")","v":"søndag"},{"$f":"M50+1","v":"2019-06-02"}]
[null,"onsdag",{"$f":"C51+1","v":"2019-04-03"},null,null,null,"fredag",{"$f":"H51+1","v":"2019-05-03"},null,null,null,"mandag",{"$f":"M51+1","v":"2019-06-03"}]
[null,"torsdag","2019-04-04",null,null,null,"lørdag","2019-05-04",null,null,null,"tirsdag","2019-06-04"]
[null,"fredag","2019-04-05",null,null,null,"søndag","2019-05-05",null,null,null,"onsdag","2019-06-05"]
[null,"lørdag","2019-04-06",null,null,null,"mandag","2019-05-06",null,null,null,"torsdag","2019-06-06"]
[null,"søndag","2019-04-07",null,null,null,"tirsdag","2019-05-07",null,null,null,"fredag","2019-06-07"]
[null,"mandag","2019-04-08",null,null,null,"onsdag","2019-05-08",null,null,null,"lørdag","2019-06-08"]
[null,"tirsdag","2019-04-09",null,null,null,"torsdag","2019-05-09",null,null,null,"søndag","2019-06-09"]
[null,"onsdag","2019-04-10",null,null,null,"fredag","2019-05-10",null,null,null,"mandag","2019-06-10"]
[null,"torsdag","2019-04-11",null,null,null,"lørdag","2019-05-11",null,null,null,"tirsdag","2019-06-11"]
[null,"fredag","2019-04-12",null,null,null,"søndag","2019-05-12",null,null,null,"onsdag","2019-06-12"]
[null,"lørdag","2019-04-13",null,null,null,"mandag","2019-05-13",null,null,null,"torsdag","2019-06-13"]
[null,"søndag","2019-04-14",null,null,null,"tirsdag","2019-05-14",null,null,null,"fredag","2019-06-14"]
[null,"mandag","2019-04-15",null,null,null,"onsdag","2019-05-15",null,null,null,"lørdag","2019-06-15"]
[null,"tirsdag","2019-04-16",null,null,null,"torsdag","2019-05-16",null,null,null,"søndag","2019-06-16"]
[null,"onsdag","2019-04-17",null,null,null,"fredag","2019-05-17",null,null,null,"mandag","2019-06-17"]
[null,"torsdag","2019-04-18",null,null,null,"lørdag","2019-05-18",null,null,null,"tirsdag","2019-06-18"]
[null,"fredag","2019-04-19",null,null,null,"søndag","2019-05-19",null,null,null,"onsdag","2019-06-19"]
[null,"lørdag","2019-04-20",null,null,null,"mandag","2019-05-20",null,null,null,"torsdag","2019-06-20"]
[null,"søndag","2019-04-21",null,null,null,"tirsdag","2019-05-21",null,null,null,"fredag","2019-06-21"]
[null,"mandag","2019-04-22",null,null,null,"onsdag","2019-05-22",null,null,null,"lørdag","2019-06-22"]
[null,"tirsdag","2019-04-23",null,null,null,"torsdag","2019-05-23",null,null,null,"søndag","2019-06-23"]
[null,"onsdag","2019-04-24",null,null,null,"fredag","2019-05-24",null,null,null,"mandag","2019-06-24"]
[null,"torsdag","2019-04-25",null,null,null,"lørdag","2019-05-25",null,null,null,"tirsdag","2019-06-25"]
[null,"fredag","2019-04-26",null,null,null,"søndag","2019-05-26",null,null,null,"onsdag","2019-06-26"]
[null,"lørdag","2019-04-27",null,null,null,"mandag","2019-05-27",null,null,null,"torsdag","2019-06-27"]
[null,"søndag","2019-04-28",null,null,null,"tirsdag","2019-05-28",null,null,null,"fredag","2019-06-28"]
[null,"mandag",{"$f":"IF(MONTH(C77+1)>MONTH(C77),\"\",C77+1)","v":"2019-04-29"},null,null,null,"onsdag",{"$f":"IF(MONTH(H77+1)>MONTH(H77),\"\",H77+1)","v":"2019-05-29"},null,null,null,"lørdag",{"$f":"IF(MONTH(M77+1)>MONTH(M77),\"\",M77+1)","v":"2019-06-29"}]
[null,"tirsdag",{"$f":"IF(MONTH(C78+1)>MONTH(C78),\"\",C78+1)","v":"2019-04-30"},null,null,null,"torsdag",{"$f":"IF(MONTH(H78+1)>MONTH(H78),\"\",H78+1)","v":"2019-05-30"},null,null,null,"søndag",{"$f":"IF(MONTH(M78+1)>MONTH(M78),\"\",M78+1)","v":"2019-06-30"}]
[null,"","",null,null,null,"fredag","2019-05-31",null,null,null,"",""]
[null,"Jan. i alt: normale timer",null,{"$f":"SUM(D50:D80)","v":0},null,null,"Jan. i alt: normale timer",null,{"$f":"SUM(I50:I80)","v":0},null,null,"Jan. i alt: normale timer",null,{"$f":"SUM(N50:N80)","v":0}]
[null,"Jan. i alt: overtid",null,null,{"$f":"SUM(E50:E80)","v":0},null,"Jan. i alt: overtid",null,null,{"$f":"SUM(J50:J80)","v":0},null,"Jan. i alt: overtid",null,null,{"$f":"SUM(O50:O80)","v":0}]
[]
[null,"Juli, august, september Timeseddel for medarbejder: daglig, ugentlig, månedlig, årlig"]
[null,{"$f":"CHOOSE(D85,\"Januar\",\"Februar\",\"Marts\",\"April\",\"Maj\",\"Juni\",\"Juli\",\"August\",\"September\",\"Oktober\",\"November\",\"December\")","v":"Juli"},null,7,null,null,{"$f":"CHOOSE(I85,\"Januar\",\"Februar\",\"Marts\",\"April\",\"Maj\",\"Juni\",\"Juli\",\"August\",\"September\",\"Oktober\",\"November\",\"December\")","v":"August"},null,8,null,null,{"$f":"CHOOSE(N85,\"Januar\",\"Februar\",\"Marts\",\"April\",\"Maj\",\"Juni\",\"Juli\",\"August\",\"September\",\"Oktober\",\"November\",\"December\")","v":"September"},null,9]
[null,"Dag","Dato","Timer","Overtid","Bemærk.","Dag","Dato","Timer","Overtid","Bemærk.","Dag","Dato","Timer","Overtid","Bemærk."]
[null,{"$f":"TEXT(C87,\"dddd\")","v":"mandag"},{"$f":"DATE(T!$B$2,D85,1)","v":"2019-07-01"},null,null,null,{"$f":"TEXT(H87,\"dddd\")","v":"torsdag"},{"$f":"DATE(T!$B$2,I85,1)","v":"2019-08-01"},null,null,null,{"$f":"TEXT(M87,\"dddd\")","v":"søndag"},{"$f":"DATE(T!$B$2,N85,1)","v":"2019-09-01"}]
[null,{"$f":"TEXT(C88,\"dddd\")","v":"tirsdag"},{"$f":"C87+1","v":"2019-07-02"},null,null,null,{"$f":"TEXT(H88,\"dddd\")","v":"fredag"},{"$f":"H87+1","v":"2019-08-02"},null,null,null,{"$f":"TEXT(M88,\"dddd\")","v":"mandag"},{"$f":"M87+1","v":"2019-09-02"}]
[null,"onsdag",{"$f":"C88+1","v":"2019-07-03"},null,null,null,"lørdag",{"$f":"H88+1","v":"2019-08-03"},null,null,null,"tirsdag",{"$f":"M88+1","v":"2019-09-03"}]
[null,"torsdag","2019-07-04",null,null,null,"søndag","2019-08-04",null,null,null,"onsdag","2019-09-04"]
[null,"fredag","2019-07-05",null,null,null,"mandag","2019-08-05",null,null,null,"torsdag","2019-09-05"]
[null,"lørdag","2019-07-06",null,null,null,"tirsdag","2019-08-06",null,null,null,"fredag","2019-09-06"]
[null,"søndag","2019-07-07",null,null,null,"onsdag","2019-08-07",null,null,null,"lørdag","2019-09-07"]
[null,"mandag","2019-07-08",null,null,null,"torsdag","2019-08-08",null,null,null,"søndag","2019-09-08"]
[null,"tirsdag","2019-07-09",null,null,null,"fredag","2019-08-09",null,null,null,"mandag","2019-09-09"]
[null,"onsdag","2019-07-10",null,null,null,"lørdag","2019-08-10",null,null,null,"tirsdag","2019-09-10"]
[null,"torsdag","2019-07-11",null,null,null,"søndag","2019-08-11",null,null,null,"onsdag","2019-09-11"]
[null,"fredag","2019-07-12",null,null,null,"mandag","2019-08-12",null,null,null,"torsdag","2019-09-12"]
[null,"lørdag","2019-07-13",null,null,null,"tirsdag","2019-08-13",null,null,null,"fredag","2019-09-13"]
[null,"søndag","2019-07-14",null,null,null,"onsdag","2019-08-14",null,null,null,"lørdag","2019-09-14"]
[null,"mandag","2019-07-15",null,null,null,"torsdag","2019-08-15",null,null,null,"søndag","2019-09-15"]
[null,"tirsdag","2019-07-16",null,null,null,"fredag","2019-08-16",null,null,null,"mandag","2019-09-16"]
[null,"onsdag","2019-07-17",null,null,null,"lørdag","2019-08-17",null,null,null,"tirsdag","2019-09-17"]
[null,"torsdag","2019-07-18",null,null,null,"søndag","2019-08-18",null,null,null,"onsdag","2019-09-18"]
[null,"fredag","2019-07-19",null,null,null,"mandag","2019-08-19",null,null,null,"torsdag","2019-09-19"]
[null,"lørdag","2019-07-20",null,null,null,"tirsdag","2019-08-20",null,null,null,"fredag","2019-09-20"]
[null,"søndag","2019-07-21",null,null,null,"onsdag","2019-08-21",null,null,null,"lørdag","2019-09-21"]
[null,"mandag","2019-07-22",null,null,null,"torsdag","2019-08-22",null,null,null,"søndag","2019-09-22"]
[null,"tirsdag","2019-07-23",null,null,null,"fredag","2019-08-23",null,null,null,"mandag","2019-09-23"]
[null,"onsdag","2019-07-24",null,null,null,"lørdag","2019-08-24",null,null,null,"tirsdag","2019-09-24"]
[null,"torsdag","2019-07-25",null,null,null,"søndag","2019-08-25",null,null,null,"onsdag","2019-09-25"]
[null,"fredag","2019-07-26",null,null,null,"mandag","2019-08-26",null,null,null,"torsdag","2019-09-26"]
[null,"lørdag","2019-07-27",null,null,null,"tirsdag","2019-08-27",null,null,null,"fredag","2019-09-27"]
[null,"søndag","2019-07-28",null,null,null,"onsdag","2019-08-28",null,null,null,"lørdag","2019-09-28"]
[null,"mandag","2019-07-29",null,null,null,"torsdag","2019-08-29",null,null,null,"søndag","2019-09-29"]
[null,"tirsdag","2019-07-30",null,null,null,"fredag","2019-08-30",null,null,null,"mandag","2019-09-30"]
[null,"onsdag","2019-07-31",null,null,null,"lørdag","2019-08-31",null,null,null,"tirsdag","2019-10-01"]
[null,"Jan. i alt: normale timer",null,{"$f":"SUM(D87:D117)","v":0},null,null,"Jan. i alt: normale timer",null,{"$f":"SUM(I87:I117)","v":0},null,null,"Jan. i alt: normale timer",null,{"$f":"SUM(N87:N117)","v":0}]
[null,"Jan. i alt: overtid",null,null,{"$f":"SUM(E87:E117)","v":0},null,"Jan. i alt: overtid",null,null,{"$f":"SUM(J87:J117)","v":0},null,"Jan. i alt: overtid",null,null,{"$f":"SUM(O87:O117)","v":0}]
[]
[null,"Oktober, november, december Timeseddel for medarbejder: daglig, ugentlig, månedlig, årlig"]
[null,{"$f":"CHOOSE(D122,\"Januar\",\"Februar\",\"Marts\",\"April\",\"Maj\",\"Juni\",\"Juli\",\"August\",\"September\",\"Oktober\",\"November\",\"December\")","v":"Oktober"},null,10,null,null,{"$f":"CHOOSE(I122,\"Januar\",\"Februar\",\"Marts\",\"April\",\"Maj\",\"Juni\",\"Juli\",\"August\",\"September\",\"Oktober\",\"November\",\"December\")","v":"November"},null,11,null,null,{"$f":"CHOOSE(N122,\"Januar\",\"Februar\",\"Marts\",\"April\",\"Maj\",\"Juni\",\"Juli\",\"August\",\"September\",\"Oktober\",\"November\",\"December\")","v":"December"},null,12]
[null,"Dag","Dato","Timer","Overtid",null,"Dag","Dato","Timer","Overtid",null,"Dag","Dato","Timer","Overtid"]
[null,{"$f":"TEXT(C124,\"dddd\")","v":"tirsdag"},{"$f":"DATE(T!$B$2,D122,1)","v":"2019-10-01"},null,null,null,{"$f":"TEXT(H124,\"dddd\")","v":"fredag"},{"$f":"DATE(T!$B$2,I122,1)","v":"2019-11-01"},null,null,null,{"$f":"TEXT(M124,\"dddd\")","v":"søndag"},{"$f":"DATE(T!$B$2,N122,1)","v":"2019-12-01"}]
[null,{"$f":"TEXT(C125,\"dddd\")","v":"onsdag"},{"$f":"C124+1","v":"2019-10-02"},null,null,null,{"$f":"TEXT(H125,\"dddd\")","v":"lørdag"},{"$f":"H124+1","v":"2019-11-02"},null,null,null,{"$f":"TEXT(M125,\"dddd\")","v":"mandag"},{"$f":"M124+1","v":"2019-12-02"}]
[null,"torsdag",{"$f":"C125+1","v":"2019-10-03"},null,null,null,"søndag",{"$f":"H125+1","v":"2019-11-03"},null,null,null,"tirsdag",{"$f":"M125+1","v":"2019-12-03"}]
[null,"fredag","2019-10-04",null,null,null,"mandag","2019-11-04",null,null,null,"onsdag","2019-12-04"]
[null,"lørdag","2019-10-05",null,null,null,"tirsdag","2019-11-05",null,null,null,"torsdag","2019-12-05"]
[null,"søndag","2019-10-06",null,null,null,"onsdag","2019-11-06",null,null,null,"fredag","2019-12-06"]
[null,"mandag","2019-10-07",null,null,null,"torsdag","2019-11-07",null,null,null,"lørdag","2019-12-07"]
[null,"tirsdag","2019-10-08",null,null,null,"fredag","2019-11-08",null,null,null,"søndag","2019-12-08"]
[null,"onsdag","2019-10-09",null,null,null,"lørdag","2019-11-09",null,null,null,"mandag","2019-12-09"]
[null,"torsdag","2019-10-10",null,null,null,"søndag","2019-11-10",null,null,null,"tirsdag","2019-12-10"]
[null,"fredag","2019-10-11",null,null,null,"mandag","2019-11-11",null,null,null,"onsdag","2019-12-11"]
[null,"lørdag","2019-10-12",null,null,null,"tirsdag","2019-11-12",null,null,null,"torsdag","2019-12-12"]
[null,"søndag","2019-10-13",null,null,null,"onsdag","2019-11-13",null,null,null,"fredag","2019-12-13"]
[null,"mandag","2019-10-14",null,null,null,"torsdag","2019-11-14",null,null,null,"lørdag","2019-12-14"]
[null,"tirsdag","2019-10-15",null,null,null,"fredag","2019-11-15",null,null,null,"søndag","2019-12-15"]
[null,"onsdag","2019-10-16",null,null,null,"lørdag","2019-11-16",null,null,null,"mandag","2019-12-16"]
[null,"torsdag","2019-10-17",null,null,null,"søndag","2019-11-17",null,null,null,"tirsdag","2019-12-17"]
[null,"fredag","2019-10-18",null,null,null,"mandag","2019-11-18",null,null,null,"onsdag","2019-12-18"]
[null,"lørdag","2019-10-19",null,null,null,"tirsdag","2019-11-19",null,null,null,"torsdag","2019-12-19"]
[null,"søndag","2019-10-20",null,null,null,"onsdag","2019-11-20",null,null,null,"fredag","2019-12-20"]
[null,"mandag","2019-10-21",null,null,null,"torsdag","2019-11-21",null,null,null,"lørdag","2019-12-21"]
[null,"tirsdag","2019-10-22",null,null,null,"fredag","2019-11-22",null,null,null,"søndag","2019-12-22"]
[null,"onsdag","2019-10-23",null,null,null,"lørdag","2019-11-23",null,null,null,"mandag","2019-12-23"]
[null,"torsdag","2019-10-24",null,null,null,"søndag","2019-11-24",null,null,null,"tirsdag","2019-12-24"]
[null,"fredag","2019-10-25",null,null,null,"mandag","2019-11-25",null,null,null,"onsdag","2019-12-25"]
[null,"lørdag","2019-10-26",null,null,null,"tirsdag","2019-11-26",null,null,null,"torsdag","2019-12-26"]
[null,"søndag","2019-10-27",null,null,null,"onsdag","2019-11-27",null,null,null,"fredag","2019-12-27"]
[null,"mandag","2019-10-28",null,null,null,"torsdag","2019-11-28",null,null,null,"lørdag","2019-12-28"]
[null,"tirsdag",{"$f":"IF(MONTH(C151+1)>MONTH(C151),\"\",C151+1)","v":"2019-10-29"},null,null,null,"fredag",{"$f":"IF(MONTH(H151+1)>MONTH(H151),\"\",H151+1)","v":"2019-11-29"},null,null,null,"søndag",{"$f":"IF(MONTH(M151+1)>MONTH(M151),\"\",M151+1)","v":"2019-12-29"}]
[null,"onsdag",{"$f":"IF(MONTH(C152+1)>MONTH(C152),\"\",C152+1)","v":"2019-10-30"},null,null,null,"lørdag",{"$f":"IF(MONTH(H152+1)>MONTH(H152),\"\",H152+1)","v":"2019-11-30"},null,null,null,"mandag",{"$f":"IF(MONTH(M152+1)>MONTH(M152),\"\",M152+1)","v":"2019-12-30"}]
[null,"torsdag","2019-10-31",null,null,null,"","",null,null,null,"tirsdag","2019-12-31"]
[null,"Jan. i alt: normale timer",null,{"$f":"SUM(D124:D154)","v":0},null,null,"Jan. i alt: normale timer",null,{"$f":"SUM(I124:I154)","v":0},null,null,"Jan. i alt: normale timer",null,{"$f":"SUM(N124:N154)","v":0}]
[null,"Jan. i alt: overtid",null,null,{"$f":"SUM(E124:E154)","v":0},null,"Jan. i alt: overtid",null,null,{"$f":"SUM(J124:J154)","v":0},null,"Jan. i alt: overtid",null,null,{"$f":"SUM(O124:O154)","v":0}]

{"sheet":"T","index":1,"n_rows":2,"n_cols":2,"rows_kept":2,"cut":false,"hidden":false,"merged":[]}
[]
["År : ",2019]

{"sheet":"SetUp","index":2,"n_rows":9,"n_cols":3,"rows_kept":9,"cut":false,"hidden":false,"merged":[[2,2,2,3],[4,2,4,3],[6,2,6,3],[8,2,8,3]]}
[]
[]
[null,"Navn: ","-"]
[]
[null,"Overordnet:","-"]
[]
[null,"E-mail:","-"]
[]
[null,"Tlf.nr.:","-"]