{"text_format":"1","workbook":"xlsx","n_sheets":4,"sheets":["Uge-plan","Weekend-plan","Ark1","ESRI_MAPINFO_SHEET"],"not_rendered":{"charts":0,"images":1,"macros":1,"external_links":0,"defined_names":2,"comments":0,"pivot_tables":0},"unopened":[],"bounds":{"document_bytes":16777216,"sheet_cells":100000,"rows_first":2000,"rows_last":500,"rows_between":2000,"halvings":0,"cell_chars":16384,"cell_head_chars":4096},"cells_cut":0,"cells_raw":0,"read":"whole","date_system":"1900"}

{"sheet":"Uge-plan","index":0,"n_rows":89,"n_cols":26,"rows_kept":89,"cut":false,"hidden":false,"merged":[[81,1,81,22],[83,1,83,22],[85,1,85,22],[87,1,87,22],[88,2,88,4],[88,5,88,7],[88,8,88,10],[88,11,88,13],[88,14,88,16],[88,17,88,19],[88,20,88,22],[71,1,71,22],[73,1,73,22],[75,1,75,22],[77,1,77,22],[79,1,79,22],[64,17,64,19],[64,20,64,22],[65,1,65,22],[67,1,67,22],[69,1,69,22],[64,2,64,4],[64,5,64,7],[64,8,64,10],[64,11,64,13],[64,14,64,16],[63,20,63,22],[57,1,57,22],[47,1,47,22],[49,1,49,22],[51,1,51,22],[53,1,53,22],[55,1,55,22],[37,1,37,22],[39,1,39,22],[41,1,41,22],[43,1,43,22],[45,1,45,22],[58,17,58,19],[58,20,58,22],[61,1,62,4],[61,5,62,5],[61,9,62,12],[63,2,63,4],[63,5,63,7],[63,8,63,10],[63,11,63,13],[63,14,63,16],[63,17,63,19],[31,1,32,4],[35,1,35,22],[17,1,17,22],[19,1,19,22],[21,1,21,22],[23,1,23,22],[25,1,25,22],[34,14,34,16],[34,17,34,19],[34,20,34,22],[33,2,33,4],[33,5,33,7],[33,8,33,10],[33,11,33,13],[33,14,33,16],[33,17,33,19],[33,20,33,22],[4,20,4,22],[7,1,7,22],[3,20,3,22],[28,2,28,4],[28,5,28,7],[28,8,28,10],[28,11,28,13],[28,14,28,16],[28,17,28,19],[28,20,28,22],[5,1,5,22],[4,2,4,4],[4,5,4,7],[4,8,4,10],[4,11,4,13],[4,14,4,16],[3,11,3,13],[3,2,3,4],[58,2,58,4],[58,5,58,7],[58,8,58,10],[58,11,58,13],[58,14,58,16],[1,9,2,12],[31,5,32,5],[31,9,32,12],[34,2,34,4],[34,5,34,7],[34,8,34,10],[34,11,34,13],[1,1,2,4],[1,5,2,5],[3,5,3,7],[3,8,3,10],[9,1,9,22],[11,1,11,22],[13,1,13,22],[15,1,15,22],[27,1,27,22],[3,14,3,16],[4,17,4,19],[3,17,3,19]]}
[]
[null,"Arbejdsplan for uge ",null,null,null,{"$f":"IF(Z2=\"\",\"\",_xlfn.ISOWEEKNUM(Z2))","v":""},null,null,null,{"$f":"IF(C5=\"\",\"\",YEAR(C5))","v":""},null,null,null,null,null,null,null,null,null,null,null,null,null,null,"Indtast dato her:"]
[]
[null,null,{"$f":"IFERROR(HelligdagsNavn(C5,0,0),\"\")","v":""},null,null,{"$f":"IFERROR(HelligdagsNavn(F5,0,0),\"\")","v":""},null,null,{"$f":"IFERROR(HelligdagsNavn(I5,0,0),\"\")","v":""},null,null,{"$f":"IFERROR(HelligdagsNavn(L5,0,0),\"\")","v":""},null,null,{"$f":"IFERROR(HelligdagsNavn(O5,0,0),\"\")","v":""},null,null,{"$f":"IFERROR(HelligdagsNavn(R5,0,0),\"\")","v":""},null,null,{"$f":"IFERROR(HelligdagsNavn(U5,0,0),\"\")","v":""}]
[null,"Navn",{"$f":"IF(Z2=\"\",\"\",Z2)","v":""},null,null,{"$f":"IF(C5=\"\",\"\",C5+1)","v":""},null,null,{"$f":"IF(F5=\"\",\"\",F5+1)","v":""},null,null,{"$f":"IF(I5=\"\",\"\",I5+1)","v":""},null,null,{"$f":"IF(L5=\"\",\"\",L5+1)","v":""},null,null,{"$f":"IF(O5=\"\",\"\",O5+1)","v":""},null,null,{"$f":"IF(R5=\"\",\"\",R5+1)","v":""}]
[]
[null,"Anette",null,"-",null,null,"-",null,null,"-",null,null,"-",null,null,"-",null,null,"-",null,null,"-"]
[]
[null,"Michelle",null,"-",null,null,"-",null,null,"-",null,null,"-",null,null,"-",null,null,"-",null,null,"-"]
[]
[null,"Bente",null,"-",null,null,"-",null,null,"-",null,null,"-",null,null,"-",null,null,"-",null,null,"-"]
[]
[null,"Mona",null,"-",null,null,"-",null,null,"-",null,null,"-",null,null,"-",null,null,"-",null,null,"-",null,null,null,"Ark Navn"]
[]
[null,"Jeanette S",null,"-",null,null,"-",null,null,"-",null,null,"-",null,null,"-",null,null,"-",null,null,"-",null,null,null,"Data sti"]
[]
[null,"Søren K",null,"-",null,null,"-",null,null,"-",null,null,"-",null,null,"-",null,null,"-",null,null,"-"]
[]
[null,"Lotte T",null,"-",null,null,"-",null,null,"-",null,null,"-",null,null,"-",null,null,"-",null,null,"-"]
[]
[null,"Jette F",null,"-",null,null,"-",null,null,"-",null,null,"-",null,null,"-",null,null,"-",null,null,"-"]
[]
[null,"Søren M",null,"-",null,null,"-",null,null,"-",null,null,"-",null,null,"-",null,null,"-",null,null,"-"]
[]
[null,"Ole",null,"-",null,null,"-",null,null,"-",null,null,"-",null,null,"-",null,null,"-",null,null,"-"]
[]
[null,null,null,"-",null,null,"-",null,null,"-",null,null,"-",null,null,"-",null,null,"-",null,null,"-"]
[]
[null,"Alarmen"]
[]
[]
[null,"Arbejdsplan for uge ",null,null,null,{"$f":"IF(C35=\"\",\"\",_xlfn.ISOWEEKNUM(C35))","v":""},null,null,null,{"$f":"IF(C35=\"\",\"\",YEAR(C35))","v":""}]
[]
[null,null,{"$f":"IFERROR(HelligdagsNavn(C35,0,0),\"\")","v":""},null,null,{"$f":"IFERROR(HelligdagsNavn(F35,0,0),\"\")","v":""},null,null,{"$f":"IFERROR(HelligdagsNavn(I35,0,0),\"\")","v":""},null,null,{"$f":"IFERROR(HelligdagsNavn(L35,0,0),\"\")","v":""},null,null,{"$f":"IFERROR(HelligdagsNavn(O35,0,0),\"\")","v":""},null,null,{"$f":"IFERROR(HelligdagsNavn(R35,0,0),\"\")","v":""},null,null,{"$f":"IFERROR(HelligdagsNavn(U35,0,0),\"\")","v":""}]
[null,"Navn",{"$f":"IF(U5=\"\",\"\",U5+1)","v":""},null,null,{"$f":"IF(C35=\"\",\"\",C35+1)","v":""},null,null,{"$f":"IF(F35=\"\",\"\",F35+1)","v":""},null,null,{"$f":"IF(I35=\"\",\"\",I35+1)","v":""},null,null,{"$f":"IF(L35=\"\",\"\",L35+1)","v":""},null,null,{"$f":"IF(O35=\"\",\"\",O35+1)","v":""},null,null,{"$f":"IF(R35=\"\",\"\",R35+1)","v":""}]
[]
[null,{"$f":"IF(B7=\"\",\"\",B7)","v":"Anette"},null,"-",null,null,"-",null,null,"-",null,null,"-",null,null,"-",null,null,"-",null,null,"-"]
[]
[null,{"$f":"IF(B9=\"\",\"\",B9)","v":"Michelle"},null,"-",null,null,"-",null,null,"-",null,null,"-",null,null,"-",null,null,"-",null,null,"-"]
[]
[null,{"$f":"IF(B11=\"\",\"\",B11)","v":"Bente"},null,"-",null,null,"-",null,null,"-",null,null,"-",null,null,"-",null,null,"-",null,null,"-"]
[]
[null,{"$f":"IF(B13=\"\",\"\",B13)","v":"Mona"},null,"-",null,null,"-",null,null,"-",null,null,"-",null,null,"-",null,null,"-",null,null,"-"]
[]
[null,{"$f":"IF(B15=\"\",\"\",B15)","v":"Jeanette S"},null,"-",null,null,"-",null,null,"-",null,null,"-",null,null,"-",null,null,"-",null,null,"-"]
[]
[null,{"$f":"IF(B17=\"\",\"\",B17)","v":"Søren K"},null,"-",null,null,"-",null,null,"-",null,null,"-",null,null,"-",null,null,"-",null,null,"-"]
[]
[null,{"$f":"IF(B19=\"\",\"\",B19)","v":"Lotte T"},null,"-",null,null,"-",null,null,"-",null,null,"-",null,null,"-",null,null,"-",null,null,"-"]
[]
[null,{"$f":"IF(B21=\"\",\"\",B21)","v":"Jette F"},null,"-",null,null,"-",null,null,"-",null,null,"-",null,null,"-",null,null,"-",null,null,"-"]
[]
[null,{"$f":"IF(B23=\"\",\"\",B23)","v":"Søren M"},null,"-",null,null,"-",null,null,"-",null,null,"-",null,null,"-",null,null,"-",null,null,"-"]
[]
[null,{"$f":"IF(B25=\"\",\"\",B25)","v":"Ole"},null,"-",null,null,"-",null,null,"-",null,null,"-",null,null,"-",null,null,"-",null,null,"-"]
[]
[null,{"$f":"IF(B27=\"\",\"\",B27)","v":""},null,"-",null,null,"-",null,null,"-",null,null,"-",null,null,"-",null,null,"-",null,null,"-"]
[]
[null,{"$f":"IF(B29=\"\",\"\",B29)","v":"Alarmen"}]
[]
[]
[null,"Arbejdsplan for uge ",null,null,null,{"$f":"IF(C65=\"\",\"\",_xlfn.ISOWEEKNUM(C65))","v":""},null,null,null,{"$f":"IF(C65=\"\",\"\",YEAR(C65))","v":""}]
[]
[null,null,{"$f":"IFERROR(HelligdagsNavn(C65,0,0),\"\")","v":""},null,null,{"$f":"IFERROR(HelligdagsNavn(F65,0,0),\"\")","v":""},null,null,{"$f":"IFERROR(HelligdagsNavn(I65,0,0),\"\")","v":""},null,null,{"$f":"IFERROR(HelligdagsNavn(L65,0,0),\"\")","v":""},null,null,{"$f":"IFERROR(HelligdagsNavn(O65,0,0),\"\")","v":""},null,null,{"$f":"IFERROR(HelligdagsNavn(R65,0,0),\"\")","v":""},null,null,{"$f":"IFERROR(HelligdagsNavn(U65,0,0),\"\")","v":""}]
[null,"Navn",{"$f":"IF(U35=\"\",\"\",U35+1)","v":""},null,null,{"$f":"IF(C65=\"\",\"\",C65+1)","v":""},null,null,{"$f":"IF(F65=\"\",\"\",F65+1)","v":""},null,null,{"$f":"IF(I65=\"\",\"\",I65+1)","v":""},null,null,{"$f":"IF(L65=\"\",\"\",L65+1)","v":""},null,null,{"$f":"IF(O65=\"\",\"\",O65+1)","v":""},null,null,{"$f":"IF(R65=\"\",\"\",R65+1)","v":""}]
[]
[null,{"$f":"IF(B37=\"\",\"\",B37)","v":"Anette"},null,"-",null,null,"-",null,null,"-",null,null,"-",null,null,"-",null,null,"-",null,null,"-"]
[]
[null,{"$f":"IF(B39=\"\",\"\",B39)","v":"Michelle"},null,"-",null,null,"-",null,null,"-",null,null,"-",null,null,"-",null,null,"-",null,null,"-"]
[]
[null,{"$f":"IF(B41=\"\",\"\",B41)","v":"Bente"},null,"-",null,null,"-",null,null,"-",null,null,"-",null,null,"-",null,null,"-",null,null,"-"]
[]
[null,{"$f":"IF(B43=\"\",\"\",B43)","v":"Mona"},null,"-",null,null,"-",null,null,"-",null,null,"-",null,null,"-",null,null,"-",null,null,"-"]
[]
[null,{"$f":"IF(B45=\"\",\"\",B45)","v":"Jeanette S"},null,"-",null,null,"-",null,null,"-",null,null,"-",null,null,"-",null,null,"-",null,null,"-"]
[]
[null,{"$f":"IF(B47=\"\",\"\",B47)","v":"Søren K"},null,"-",null,null,"-",null,null,"-",null,null,"-",null,null,"-",null,null,"-",null,null,"-"]
[]
[null,{"$f":"IF(B49=\"\",\"\",B49)","v":"Lotte T"},null,"-",null,null,"-",null,null,"-",null,null,"-",null,null,"-",null,null,"-",null,null,"-"]
[]
[null,{"$f":"IF(B51=\"\",\"\",B51)","v":"Jette F"},null,"-",null,null,"-",null,null,"-",null,null,"-",null,null,"-",null,null,"-",null,null,"-"]
[]
[null,{"$f":"IF(B53=\"\",\"\",B53)","v":"Søren M"},null,"-",null,null,"-",null,null,"-",null,null,"-",null,null,"-",null,null,"-",null,null,"-"]
[]
[null,{"$f":"IF(B55=\"\",\"\",B55)","v":"Ole"},null,"-",null,null,"-",null,null,"-",null,null,"-",null,null,"-",null,null,"-",null,null,"-"]
[]
[null,{"$f":"IF(B57=\"\",\"\",B57)","v":""},null,"-",null,null,"-",null,null,"-",null,null,"-",null,null,"-",null,null,"-",null,null,"-"]
[]
[null,{"$f":"IF(B59=\"\",\"\",B59)","v":"Alarmen"}]

{"sheet":"Weekend-plan","index":1,"n_rows":11,"n_cols":18,"rows_kept":11,"cut":false,"hidden":true,"merged":[[0,0,0,1]]}
["Arbejdsplan for uge",null,{"$f":"_xlfn.ISOWEEKNUM(L1)","v":51},null,null,null,null,null,null,null,null,"2020-12-14"]
[]
["Navn",null,{"$f":"(L1)","v":"2020-12-14"},{"$f":"C3+1","v":"2020-12-15"},{"$f":"D3+1","v":"2020-12-16"},"2020-12-17","2020-12-18","2020-12-19","2020-12-20"]
[]
[]
[]
[]
[]
[]
[null,null,null,null,null,null,null,null,null,null,null,null,null,"start","slut","pause"]
["Mona",null,"8.30 - 15.30","8.30 - 15.30","8.30 - 15.30","8.30 - 15.30","8.30 - 15.30"," "," ",null,null,null,null,"08:30:00","15:30:00","01:00:00","=",{"$f":"(O11-N11)-P11","v":"06:00:00"}]

{"sheet":"Ark1","index":2,"n_rows":10,"n_cols":2,"rows_kept":10,"cut":false,"hidden":true,"merged":[]}
[]
[null,"-"]
[null,"Afspadsering"]
[null,"Planlagt fri"]
[null,"Arena"]
[null,"Ferie"]
[null,"Vagt"]
[null,"S/H"]
[null,"Sygemeldt"]
[null,"Kursus"]

{"sheet":"ESRI_MAPINFO_SHEET","index":3,"n_rows":0,"n_cols":0,"rows_kept":0,"cut":false,"hidden":true,"merged":[]}